Target
Tyrosine-protein phosphatase non-receptor type 11
Ligand
BDBM396037
Substrate
Meas. Tech.
SHP2 Allosteric Inhibition Assay
IC50
25.0±n/a nM
Citation
 Chen, ZFortanet, JGLaMarche, MJSendzik, MTamez, Jr., VYu, B Compounds and compositions for inhibiting the activity of SHP2 US Patent  US10308660 Publication Date 6/4/2019 
Target
Name:
Tyrosine-protein phosphatase non-receptor type 11
Synonyms:
3.1.3.48 PTP-1D PTP2C Protein Tyrosine Phosphatase PPN11/Shp2 Protein-Tyrosine Phosphatase SHP-2 Protein-tyrosine phosphatase 2C SH-PTP3 SHP2 Src homology phosphatase 2 (SHP-2) Tyrosine-protein phosphatase non-receptor type 11 (SHP-2) | Tyrosine-protein phosphatase non-receptor type 11 (SHP2)
Type:
Protein phosphatase
Mol. Mass.:
68443.59
Organism:
Homo sapiens (Human)
Description:
Q06124
Residue:
593
  
Inhibitor
Name:
BDBM396037
Synonyms:
US10308660, Example 139
Type:
Small organic molecule
Emp. Form.:
C23H31N5O3
Mol. Mass.:
425.5239
SMILES:
C[C@@H]1OCC2(CCN(CC2)c2nc(N)c(-c3ccc(OC4CC4)cc3)c(=O)n2C)[C@@H]1N
: