Target
Phosphatidylinositol 4,5-bisphosphate 3-kinase catalytic subunit delta isoform
Ligand
BDBM259879
Substrate
Meas. Tech.
in vitro kinase inhibition assay
IC50
53.0±n/a nM
Citation
 Durden, DLMorales, GAGarlich, JR Thienopyranones as kinase and epigenetic inhibitors US Patent  US10308662 Publication Date 6/4/2019 
Target
Name:
Phosphatidylinositol 4,5-bisphosphate 3-kinase catalytic subunit delta isoform
Synonyms:
PI3-kinase p110 subunit delta PI3-kinase subunit p110-delta PIK3CD Phosphatidylinositol 4,5-biphosphate 3-kinase catalytic subunit delta (PIK3CD) Phosphatidylinositol 4,5-bisphosphate 3-kinase 110 kDa catalytic subunit delta (PI3K delta) Phosphatidylinositol 4,5-bisphosphate 3-kinase catalytic subunit delta (PI3Kdelta) Phosphatidylinositol 4,5-bisphosphate 3-kinase catalytic subunit delta isoform (PI3K delta) Phosphatidylinositol 4,5-bisphosphate 3-kinase catalytic subunit delta isoform (PI3K-delta) Phosphatidylinositol 4,5-bisphosphate 3-kinase catalytic subunit delta isoform (PI3Kdelta)
Type:
Enzyme Subunit
Mol. Mass.:
119489.41
Organism:
Homo sapiens (Human)
Description:
O00329
Residue:
1044
  
Inhibitor
Name:
BDBM259879
Synonyms:
US10308662, Compound 118 | US9505780, 118
Type:
Small organic molecule
Emp. Form.:
C18H16N2O5S
Mol. Mass.:
372.395
SMILES:
ONC(=O)c1ccc(cc1)-c1csc2c1oc(cc2=O)N1CCOCC1
: