Target
Phosphatidylinositol 3-kinase regulatory subunit alpha
Ligand
BDBM50427488
Substrate
Meas. Tech.
in vitro kinase inhibition assay
IC50
55.2±n/a nM
Citation
 Durden, DLMorales, GAGarlich, JR Thienopyranones as kinase and epigenetic inhibitors US Patent  US10308662 Publication Date 6/4/2019 
Target
Name:
Phosphatidylinositol 3-kinase regulatory subunit alpha
Synonyms:
GRB1 PI3-kinase class I PI3-kinase p85-alpha subunit PI3-kinase subunit p85-alpha PIK3CG/PIK3R1 Phosphatidylinositol 3-kinase 85 kDa regulatory subunit alpha (PI3K alpha) Phosphatidylinositol 3-kinase regulatory subunit alpha (PIK3R1) Phosphatidylinositol 3-kinase regulatory subunit alpha isoform 1 (PI3 Kinase alpha) Phosphatidylinositol 4,5-bisphosphate 3-kinase catalytic subunit alpha isoform (PI3Kalpha) PtdIns-3-kinase p85-alpha p85 alpha
Type:
Protein
Mol. Mass.:
83592.82
Organism:
Homo sapiens (Human)
Description:
P27986
Residue:
724
  
Inhibitor
Name:
BDBM50427488
Synonyms:
CHEMBL2326956 US9505780, 100
Type:
Small organic molecule
Emp. Form.:
C18H15NO5S
Mol. Mass.:
357.38
SMILES:
OC(=O)c1ccc(cc1)-c1csc2c1oc(cc2=O)N1CCOCC1
: