Target
Ghrelin O-acyltransferase
Ligand
BDBM396112
Substrate
Meas. Tech.
hGOAT Activity in HEK293 Cells after Incubation
IC50
0.038±n/a nM
Citation
 Godbout, CTrieselmann, TVintonyak, V Oxadiazolopyridine derivatives for use as ghrelin O-acyl transferase (GOAT) inhibitors US Patent  US10308667 Publication Date 6/4/2019 
Target
Name:
Ghrelin O-acyltransferase
Synonyms:
GOAT MBOA4_HUMAN Membrane-bound O-acyltransferase domain-containing protein 4 OACT4
Type:
Enzyme
Mol. Mass.:
49733.10
Organism:
Homo sapiens (Human)
Description:
Q96T53
Residue:
435
  
Inhibitor
Name:
BDBM396112
Synonyms:
6-(6-Bromo-5-difluoromethoxy-pyridin-2-ylmethyl)-5-methyl-[1,2,5]oxadiazolo[3,4-b]pyridin-7-ylamine | US10308667, Example 15
Type:
Small organic molecule
Emp. Form.:
C13H10BrF2N5O2
Mol. Mass.:
386.152
SMILES:
Cc1nc2nonc2c(N)c1Cc1ccc(OC(F)F)c(Br)n1
: