Target
Ghrelin O-acyltransferase
Ligand
BDBM396165
Substrate
Meas. Tech.
hGOAT Activity in HEK293 Cells after Incubation
IC50
0.110±n/a nM
Citation
 Godbout, CTrieselmann, TVintonyak, V Oxadiazolopyridine derivatives for use as ghrelin O-acyl transferase (GOAT) inhibitors US Patent  US10308667 Publication Date 6/4/2019 
Target
Name:
Ghrelin O-acyltransferase
Synonyms:
GOAT MBOA4_HUMAN Membrane-bound O-acyltransferase domain-containing protein 4 OACT4
Type:
Enzyme
Mol. Mass.:
49733.10
Organism:
Homo sapiens (Human)
Description:
Q96T53
Residue:
435
  
Inhibitor
Name:
BDBM396165
Synonyms:
6-[6-Amino-5-(2,4-dimethyl-2H-pyrazol-3-yl)-pyridin-2-ylmethyl]-5-methyl-[1,2,5]oxadiazolo[3,4-b]pyridin-7-ylamine | US10308667, Example 68
Type:
Small organic molecule
Emp. Form.:
C17H18N8O
Mol. Mass.:
350.3778
SMILES:
Cc1cnn(C)c1-c1ccc(Cc2c(C)nc3nonc3c2N)nc1N
: