Target
Ghrelin O-acyltransferase
Ligand
BDBM396194
Substrate
Meas. Tech.
hGOAT Activity in HEK293 Cells after Incubation
IC50
0.022±n/a nM
Citation
 Godbout, CTrieselmann, TVintonyak, V Oxadiazolopyridine derivatives for use as ghrelin O-acyl transferase (GOAT) inhibitors US Patent  US10308667 Publication Date 6/4/2019 
Target
Name:
Ghrelin O-acyltransferase
Synonyms:
GOAT MBOA4_HUMAN Membrane-bound O-acyltransferase domain-containing protein 4 OACT4
Type:
Enzyme
Mol. Mass.:
49733.10
Organism:
Homo sapiens (Human)
Description:
Q96T53
Residue:
435
  
Inhibitor
Name:
BDBM396194
Synonyms:
6-(5-Bromo-6-methoxy-pyridin-2-ylmethyl)-5-methyl-[1,2,5]oxadiazolo[3,4-b]pyridin-7-ylamine | US10308667, Example 97
Type:
Small organic molecule
Emp. Form.:
C13H12BrN5O2
Mol. Mass.:
350.171
SMILES:
COc1nc(Cc2c(C)nc3nonc3c2N)ccc1Br
: