Target
Ghrelin O-acyltransferase
Ligand
BDBM396221
Substrate
Meas. Tech.
hGOAT Activity in HEK293 Cells after Incubation
IC50
0.056±n/a nM
Citation
 Godbout, CTrieselmann, TVintonyak, V Oxadiazolopyridine derivatives for use as ghrelin O-acyl transferase (GOAT) inhibitors US Patent  US10308667 Publication Date 6/4/2019 
Target
Name:
Ghrelin O-acyltransferase
Synonyms:
GOAT MBOA4_HUMAN Membrane-bound O-acyltransferase domain-containing protein 4 OACT4
Type:
Enzyme
Mol. Mass.:
49733.10
Organism:
Homo sapiens (Human)
Description:
Q96T53
Residue:
435
  
Inhibitor
Name:
BDBM396221
Synonyms:
3-[6-(7-Amino-5-methyl-[1,2,5]oxadiazolo[3,4-b]pyridin-6-ylmethyl)-3-bromo-pyridin-2-ylamino]-2,2-di methyl-propionamide | US10308667, Example 124
Type:
Small organic molecule
Emp. Form.:
C17H20BrN7O2
Mol. Mass.:
434.29
SMILES:
Cc1nc2nonc2c(N)c1Cc1ccc(Br)c(NCC(C)(C)C(N)=O)n1
: