Target
Ghrelin O-acyltransferase
Ligand
BDBM396240
Substrate
Meas. Tech.
hGOAT Activity in HEK293 Cells after Incubation
IC50
0.046±n/a nM
Citation
 Godbout, CTrieselmann, TVintonyak, V Oxadiazolopyridine derivatives for use as ghrelin O-acyl transferase (GOAT) inhibitors US Patent  US10308667 Publication Date 6/4/2019 
Target
Name:
Ghrelin O-acyltransferase
Synonyms:
GOAT MBOA4_HUMAN Membrane-bound O-acyltransferase domain-containing protein 4 OACT4
Type:
Enzyme
Mol. Mass.:
49733.10
Organism:
Homo sapiens (Human)
Description:
Q96T53
Residue:
435
  
Inhibitor
Name:
BDBM396240
Synonyms:
6-(7-Amino-5-methyl-[1,2,5]oxadiazolo[3,4-b]pyridin-6-ylmethyl)-2-(3,3-difluoro-pyrrolidin-1-yl)-nicotinonitrile | US10308667, Example 143
Type:
Small organic molecule
Emp. Form.:
C17H15F2N7O
Mol. Mass.:
371.3441
SMILES:
Cc1nc2nonc2c(N)c1Cc1ccc(C#N)c(n1)N1CCC(F)(F)C1
: