Target
Genome polyprotein
Ligand
BDBM30456
Substrate
biotinylated oligo (rG13)/poly rC
Meas. Tech.
NS5B Polymerase Inhibition Assay (IC50) and HCV Replicon Assay (EC50)
pH
7.5±n/a
Temperature
301.15±n/a K
IC50
16±n/a nM
EC50
300±n/a nM
Citation
 Ruebsam, FSun, ZAyida, BKWebber, SEZhou, YZhao, QKissinger, CRShowalter, REShah, AMTsan, MPatel, RLebrun, LAKamran, RSergeeva, MVBartkowski, DMNolan, TGNorris, DAKirkovsky, L Hexahydro-pyrrolo- and hexahydro-1H-pyrido[1,2-b]pyridazin-2-ones as potent inhibitors of HCV NS5B polymerase. Bioorg Med Chem Lett 18:5002-5 (2008)  
Target
Name:
Genome polyprotein
Synonyms:
Genome polyprotein POLG_HCVBK | RNA-directed RNA polymerase (NS5B)
Type:
Protein
Mol. Mass.:
327252.46
Organism:
Hepatitis C virus genotype 1b (isolate BK) (HCV)
Description:
P26663
Residue:
3010
  
Inhibitor
Name:
BDBM30456
Synonyms:
hexahydro-1H-pyrido[1,2-b]pyridazin-2-one, 4g
Type:
Small organic molecule
Emp. Form.:
C23H24FN5O6S2
Mol. Mass.:
549.595
SMILES:
CS(=O)(=O)Nc1ccc2N=C(NS(=O)(=O)c2c1)C1C(=O)C2CCCCN2N(Cc2ccc(F)cc2)C1=O
:
Substrate
Name:
biotinylated oligo (rG13)/poly rC
Synonyms:
Type:
RNA
Mol. Mass.:
358.43
Organism:
Description:
[alpha-33P]GTP/GTP as co-substrate.
Residue:
3
NA