Target
Epidermal growth factor receptor [G719C]
Ligand
BDBM31094
Substrate
biotinylated affinity ligand
Meas. Tech.
Kinase Inhibitor Selectivity Profiling Assay
pH
7.4±n/a
Temperature
298.15±n/a K
Kd
1500±n/a nM
Citation
 PubChem, PC Kinase Inhibitor Selectivity Profiling Assay PubChem Bioassay (2008)[AID] 
Target
Name:
Epidermal growth factor receptor [G719C]
Synonyms:
EGF-R Tyrosine Kinase Mutant (G719C) EGFR (G719C) ERBB Epidermal growth factor receptor (EGFR)(G719C) | HER1
Type:
Tyrosine-protein kinase
Mol. Mass.:
134325.68
Organism:
Homo sapiens (Human)
Description:
gi_29725609
Residue:
1210
  
Inhibitor
Name:
BDBM31094
Synonyms:
PKC-412 | cid_24202429
Type:
Small organic molecule
Emp. Form.:
C35H30N4O4
Mol. Mass.:
570.6371
SMILES:
[H][C@@]12C[C@@H]([C@H](OC)[C@@](C)(O1)n1c3ccccc3c3c4CNC(=O)c4c4c5ccccc5n2c4c13)N(C)C(=O)c1ccccc1
:
Substrate
Name:
biotinylated affinity ligand
Synonyms:
Type:
Mol. Mass.:
358.43
Organism:
Description:
Residue:
3
NA