Target
Inhibitor of nuclear factor kappa-B kinase subunit alpha
Ligand
BDBM396931
Substrate
Meas. Tech.
Biological Assay
IC50
224±n/a nM
Citation
 Hynd, GTisselli, PClark, DEKulagowski, JJMacLeod, CMann, SERoussel, FJPrice, SCMontana, JG 3-(1H-pyrazol-4-yl)-1H-pyrrolo[2,3-c]pyridine derivatives as NIK inhibitors US Patent  US9981963 Publication Date 5/29/2018 
Target
Name:
Inhibitor of nuclear factor kappa-B kinase subunit alpha
Synonyms:
CHUK I-kappa-B kinase 1 IKK-A IKK1 IKKA IkBKA Inhibitor of NF-kappa-B kinase alpha/beta Nuclear factor NF-kappa-B inhibitor kinase alpha TCF16 | Transcription factor 16
Type:
PROTEIN
Mol. Mass.:
84642.21
Organism:
Homo sapiens (Human)
Description:
ChEMBL_327453
Residue:
745
  
Inhibitor
Name:
BDBM396931
Synonyms:
US9981963, Compound 22
Type:
Small organic molecule
Emp. Form.:
C22H20N4O
Mol. Mass.:
356.4204
SMILES:
CC(C)(O)C#Cc1cc2c(cn(Cc3ccccc3)c2cn1)-c1cn[nH]c1
: