Target
Orexin/Hypocretin receptor type 1
Ligand
BDBM397085
Substrate
Meas. Tech.
FLIPR Ca2+ Flux Assay
IC50
6875±n/a nM
Citation
 Kuduk, SDLiverton, NReger, TSSkudlarek, JW 5,5-bicyclic oxazole orexin receptor antagonists US Patent  US9987255 Publication Date 6/5/2018 
Target
Name:
Orexin/Hypocretin receptor type 1
Synonyms:
HCRTR1 OX1R_HUMAN Orexin receptor type 1 (OR 1) Orexin receptor type 1 (OX1) Orexin receptor type 1 (OxR1) | Ox1r
Type:
Protein
Mol. Mass.:
47554.50
Organism:
Homo sapiens (Human)
Description:
O43613
Residue:
425
  
Inhibitor
Name:
BDBM397085
Synonyms:
(2-(2H-1,2,3-triazol-2-yl)phenyl)(5-(4-(2-hydroxypropan-2-yl)-5-methyloxazol-2-yl)hexahydropyrrolo[3,4-c]pyrrol-2(1H)-yl)methanon | US9987255, 1
Type:
Small organic molecule
Emp. Form.:
C22H26N6O3
Mol. Mass.:
422.4802
SMILES:
Cc1oc(nc1C(C)(C)O)N1CC2CN(CC2C1)C(=O)c1ccccc1-n1nccn1
: