Target
Orexin/Hypocretin receptor type 1
Ligand
BDBM397100
Substrate
Meas. Tech.
FLIPR Ca2+ Flux Assay
IC50
10000±n/a nM
Citation
 Kuduk, SDLiverton, NReger, TSSkudlarek, JW 5,5-bicyclic oxazole orexin receptor antagonists US Patent  US9987255 Publication Date 6/5/2018 
Target
Name:
Orexin/Hypocretin receptor type 1
Synonyms:
HCRTR1 OX1R_HUMAN Orexin receptor type 1 (OR 1) Orexin receptor type 1 (OX1) Orexin receptor type 1 (OxR1) | Ox1r
Type:
Protein
Mol. Mass.:
47554.50
Organism:
Homo sapiens (Human)
Description:
O43613
Residue:
425
  
Inhibitor
Name:
BDBM397100
Synonyms:
2-{5-methyl-2-[5-{(2-(1H- pyrazol-1- yl)phenyl]carbonyl}hexahydropyrrolo [3,4-c]pyrrol-2(1H)-yl]-1,3- oxazol-4-yl}propan-2-ol | US9987255, 14
Type:
Small organic molecule
Emp. Form.:
C23H27N5O3
Mol. Mass.:
421.4922
SMILES:
Cc1oc(nc1C(C)(C)O)N1CC2CN(CC2C1)C(=O)c1ccccc1-n1cccn1
: