Target
Lys-gingipain W83
Ligand
BDBM397463
Substrate
Meas. Tech.
Inhibition Assay
IC50
75±n/a nM
Citation
 Konradi, ADominy, SSLynch, CCCoburn, CVacca, J Inhibitors of lysine gingipain US Patent  US9988375 Publication Date 6/5/2018 
Target
Name:
Lys-gingipain W83
Synonyms:
KGP83_PORGN Lysine specific cysteine protease Porphypain kgp prtP
Type:
Mol. Mass.:
187834.89
Organism:
Porphyromonas gingivalis
Description:
Q51817
Residue:
1732
  
Inhibitor
Name:
BDBM397463
Synonyms:
US10676470, Compound 42 US9988375, Compound 42
Type:
Small organic molecule
Emp. Form.:
C15H23N3O2S
Mol. Mass.:
309.427
SMILES:
NCCCC[C@H](NC(=O)C1CCCC1)C(=O)c1nccs1
: