Target
Cyclin-A2/Cyclin-dependent kinase 2
Ligand
BDBM31558
Substrate
Histone H1
Meas. Tech.
Kinase SPA Assay
pH
7.4±n/a
Temperature
296.15±n/a K
IC50
83±n/a nM
Citation
 Brasca, MGAmboldi, NBallinari, DCameron, ACasale, ECervi, GColombo, MColotta, FCroci, VD'Alessio, RFiorentini, FIsacchi, AMercurio, CMoretti, WPanzeri, APastori, WPevarello, PQuartieri, FRoletto, FTraquandi, GVianello, PVulpetti, ACiomei, M Identification of N,1,4,4-Tetramethyl-8-{[4-(4-methylpiperazin-1-yl)phenyl]amino}-4,5-dihydro-1H-pyrazolo[4,3-h]quinazoline-3-carboxamide (PHA-848125), a Potent, Orally Available Cyclin Dependent Kinase Inhibitor. J Med Chem 52:5152-63 (2009)  
Target
Name:
Cyclin-A2/Cyclin-dependent kinase 2
Synonyms:
CDK2-CyclinA CDK2/Cyclin A Cyclin A2/dependent kinase 2 Cyclin-Dependent Kinase 2 (CDK2A)
Type:
Protein Complex
Mol. Mass.:
Description:
Cdk2/Cyclin A kinase was purified from insect cells coinfected with Cyclin A/Cdk2 baculovirus.
Components:
This complex has 2 components.
Component 1
Name:
Cyclin-dependent kinase 2
Synonyms:
CDK2 CDK2_HUMAN Cell division protein kinase 2 Protein cereblon/Cyclin-dependent kinase 2 | p33 protein kinase
Type:
Enzyme Subunit
Mol. Mass.:
33938.17
Organism:
Homo sapiens (Human)
Description:
P24941
Residue:
298
  
Component 2
Name:
Cyclin-A2
Synonyms:
CCN1 CCNA1 CCNA2_HUMAN Cyclin-A
Type:
Enzyme Subunit
Mol. Mass.:
48550.19
Organism:
Homo sapiens (Human)
Description:
P20248
Residue:
432
  
Inhibitor
Name:
BDBM31558
Synonyms:
pyrazolo[4,3-h]quinazoline-3-carboxamide, 41
Type:
Small organic molecule
Emp. Form.:
C23H29N7O
Mol. Mass.:
419.5227
SMILES:
CNC(=O)c1nn(C)c-2c1C(C)(C)Cc1cnc(Nc3cccc(CN(C)C)c3)nc-21
:
Substrate
Name:
Histone H1
Synonyms:
Type:
Other Protein Type
Mol. Mass.:
358.43
Organism:
Bos taurus (bovine)
Description:
Residue:
3
NA