Target
Mitogen-activated protein kinase 14
Ligand
BDBM330285
Substrate
Meas. Tech.
Enzyme Inhibition Assay
IC50
105±n/a nM
Citation
 Ito, KCharron, CEKing-Underwood, JOnions, STLongshaw, AI 1-pyrazolyl-3-(4-((2-anilinopyrimidin-4-yl) oxy) napththalen-1-yl) ureas as P38 MAP knase inhibitors US Patent  US9993478 Publication Date 6/12/2018 
Target
Name:
Mitogen-activated protein kinase 14
Synonyms:
CSAID-binding protein CSBP1 CSPB1 MAP kinase 14 MAP kinase p38 alpha MAPK14 MK14_HUMAN Mitogen-activated protein kinase p38 alpha Stress-activated protein kinase 2a | p38 MAP kinase alpha/beta
Type:
Serine/threonine-protein kinase
Mol. Mass.:
41286.76
Organism:
Homo sapiens (Human)
Description:
Q16539
Residue:
360
  
Inhibitor
Name:
BDBM330285
Synonyms:
1-(3-(tert-butyl)-1-(p-tolyl)-1H-pyrazol-5-yl)- 3-(4-((2-((3,4-dimethoxyphenyl)amino) pyrimidin-4-yl)oxy)naphthalen-1-yl)urea US10813932, Example 27 US9993478, Example 27
Type:
Small organic molecule
Emp. Form.:
C37H37N7O4
Mol. Mass.:
643.7342
SMILES:
COc1ccc(Nc2nccc(Oc3ccc(NC(=O)Nc4cc(nn4-c4ccc(C)cc4)C(C)(C)C)c4ccccc34)n2)cc1OC
: