Target
Lysine-specific histone demethylase 1A
Ligand
BDBM397533
Substrate
Meas. Tech.
Biochemical Assay
IC50
30±n/a nM
Citation
 Wu, LYao, W Cyclopropylamines as LSD1 inhibitors US Patent  US9994546 Publication Date 6/12/2018 
Target
Name:
Lysine-specific histone demethylase 1A
Synonyms:
AOF2 Flavin-containing amine oxidase domain-containing protein 2 KDM1A KIAA0601 Lysine-specific demethylase 1 (LSD1) Lysine-specific histone demethylase 1 (LSD1)
Type:
Enzyme
Mol. Mass.:
92901.01
Organism:
Homo sapiens (Human)
Description:
O60341
Residue:
852
  
Inhibitor
Name:
BDBM397533
Synonyms:
US10676457, Example 32 US9994546, Example 32 | [1-(4-{[(trans-2-Phenylcyclopropyl)amino]methyl}piperidin-1-yl)cyclobutyl]acetonitrile
Type:
Small organic molecule
Emp. Form.:
C21H29N3
Mol. Mass.:
323.4751
SMILES:
N#CCC1(CCC1)N1CCC(CNC2CC2c2ccccc2)CC1
: