Target
Serine/threonine-protein kinase TBK1
Ligand
BDBM397643
Substrate
Meas. Tech.
Inhibition Assay
IC50
10.0±n/a nM
Citation
 Bigi, SKeung, WSwann, SVu, PHWoodhead, SJGangloff, AR Heteroarylamide inhibitors of TBK1 US Patent  US9994547 Publication Date 6/12/2018 
Target
Name:
Serine/threonine-protein kinase TBK1
Synonyms:
NAK Protein cereblon/Serine/threonine-protein kinase TBK1 TANK-binding kinase 1 (TBK-1) TBK1 | TBK1_HUMAN
Type:
protein
Mol. Mass.:
83645.20
Organism:
Homo sapiens (Human)
Description:
Q9UHD2
Residue:
729
  
Inhibitor
Name:
BDBM397643
Synonyms:
(S)-N-(5-(4-cyano-3-((1-(ethyl(methyl)amino)-1-oxopropan-2-yl)amino)phenyl)pyrazin-2-yl)cyclopropanecarboxamide | US9994547, Example 12
Type:
Small organic molecule
Emp. Form.:
C21H24N6O2
Mol. Mass.:
392.4543
SMILES:
CCN(C)C(=O)[C@H](C)Nc1cc(ccc1C#N)-c1cnc(NC(=O)C2CC2)cn1
: