Target
Serine/threonine-protein kinase TBK1
Ligand
BDBM397649
Substrate
Meas. Tech.
Inhibition Assay
IC50
31.6±n/a nM
Citation
 Bigi, SKeung, WSwann, SVu, PHWoodhead, SJGangloff, AR Heteroarylamide inhibitors of TBK1 US Patent  US9994547 Publication Date 6/12/2018 
Target
Name:
Serine/threonine-protein kinase TBK1
Synonyms:
NAK Protein cereblon/Serine/threonine-protein kinase TBK1 TANK-binding kinase 1 (TBK-1) TBK1 | TBK1_HUMAN
Type:
protein
Mol. Mass.:
83645.20
Organism:
Homo sapiens (Human)
Description:
Q9UHD2
Residue:
729
  
Inhibitor
Name:
BDBM397649
Synonyms:
N-(5-(4-cyano-3-((1-(dimethylamino)-3-hydroxy-1-oxopropan-2-yl)amino)phenyl)pyrazin-2-yl)cyclopropanecarboxamide (3.6 mg, 9.13 μmol, 8.60% yield) | US9994547, Example 18
Type:
Small organic molecule
Emp. Form.:
C20H22N6O3
Mol. Mass.:
394.4271
SMILES:
CN(C)C(=O)C(CO)Nc1cc(ccc1C#N)-c1cnc(NC(=O)C2CC2)cn1
: