Target
Serine/threonine-protein kinase TBK1
Ligand
BDBM397687
Substrate
Meas. Tech.
Inhibition Assay
IC50
20.0±n/a nM
Citation
 Bigi, SKeung, WSwann, SVu, PHWoodhead, SJGangloff, AR Heteroarylamide inhibitors of TBK1 US Patent  US9994547 Publication Date 6/12/2018 
Target
Name:
Serine/threonine-protein kinase TBK1
Synonyms:
NAK Protein cereblon/Serine/threonine-protein kinase TBK1 TANK-binding kinase 1 (TBK-1) TBK1 | TBK1_HUMAN
Type:
protein
Mol. Mass.:
83645.20
Organism:
Homo sapiens (Human)
Description:
Q9UHD2
Residue:
729
  
Inhibitor
Name:
BDBM397687
Synonyms:
(S)-N-(5-(6-cyano-5-((1-((2-fluoroethyl)(methyl)amino)-1-oxobutan-2-yl)amino)pyridin-3-yl)pyrazin-2-yl)cyclopropanecarboxamide | US9994547, Example 56
Type:
Small organic molecule
Emp. Form.:
C21H24FN7O2
Mol. Mass.:
425.4594
SMILES:
CC[C@H](Nc1cc(cnc1C#N)-c1cnc(NC(=O)C2CC2)cn1)C(=O)N(C)CCF
: