Target
Serine/threonine-protein kinase TBK1
Ligand
BDBM397722
Substrate
Meas. Tech.
Inhibition Assay
IC50
20.0±n/a nM
Citation
 Bigi, SKeung, WSwann, SVu, PHWoodhead, SJGangloff, AR Heteroarylamide inhibitors of TBK1 US Patent  US9994547 Publication Date 6/12/2018 
Target
Name:
Serine/threonine-protein kinase TBK1
Synonyms:
NAK Protein cereblon/Serine/threonine-protein kinase TBK1 TANK-binding kinase 1 (TBK-1) TBK1 | TBK1_HUMAN
Type:
protein
Mol. Mass.:
83645.20
Organism:
Homo sapiens (Human)
Description:
Q9UHD2
Residue:
729
  
Inhibitor
Name:
BDBM397722
Synonyms:
N-(5-(6-cyano-5-(((S)-1-((S)-3-methylmorpholino)-1-oxopropan-2-yl)amino)pyridin-3-yl)pyrazin-2-yl)cyclopropanecarboxamide | US9994547, Example 91
Type:
Small organic molecule
Emp. Form.:
C22H25N7O3
Mol. Mass.:
435.479
SMILES:
C[C@H](Nc1cc(cnc1C#N)-c1cnc(NC(=O)C2CC2)cn1)C(=O)N1CCOC[C@@H]1C
: