Target
Serine/threonine-protein kinase TBK1
Ligand
BDBM397768
Substrate
Meas. Tech.
Inhibition Assay
IC50
25.1±n/a nM
Citation
 Bigi, SKeung, WSwann, SVu, PHWoodhead, SJGangloff, AR Heteroarylamide inhibitors of TBK1 US Patent  US9994547 Publication Date 6/12/2018 
Target
Name:
Serine/threonine-protein kinase TBK1
Synonyms:
NAK Protein cereblon/Serine/threonine-protein kinase TBK1 TANK-binding kinase 1 (TBK-1) TBK1 | TBK1_HUMAN
Type:
protein
Mol. Mass.:
83645.20
Organism:
Homo sapiens (Human)
Description:
Q9UHD2
Residue:
729
  
Inhibitor
Name:
BDBM397768
Synonyms:
(S)-N-(5-(4-cyano-3-((1-(dimethylamino)-1-oxopropan-2-yl)amino)-5-fluorophenyl)pyrazin-2-yl)cyclopropanecarboxamide | US9994547, Example 137
Type:
Small organic molecule
Emp. Form.:
C20H21FN6O2
Mol. Mass.:
396.4181
SMILES:
C[C@H](Nc1cc(cc(F)c1C#N)-c1cnc(NC(=O)C2CC2)cn1)C(=O)N(C)C
: