Target
Serine/threonine-protein kinase TBK1
Ligand
BDBM397780
Substrate
Meas. Tech.
Inhibition Assay
IC50
31.6±n/a nM
Citation
 Bigi, SKeung, WSwann, SVu, PHWoodhead, SJGangloff, AR Heteroarylamide inhibitors of TBK1 US Patent  US9994547 Publication Date 6/12/2018 
Target
Name:
Serine/threonine-protein kinase TBK1
Synonyms:
NAK Protein cereblon/Serine/threonine-protein kinase TBK1 TANK-binding kinase 1 (TBK-1) TBK1 | TBK1_HUMAN
Type:
protein
Mol. Mass.:
83645.20
Organism:
Homo sapiens (Human)
Description:
Q9UHD2
Residue:
729
  
Inhibitor
Name:
BDBM397780
Synonyms:
(S)-N-(5-(6-cyano-5-((1-((2,2-difluoroethyl)(methyl)amino)-1-oxopropan-2-yl)amino)pyridin-3-yl)pyrazin-2-yl)-3-methoxycyclobutanecarboxamide | US9994547, Example 149
Type:
Small organic molecule
Emp. Form.:
C22H25F2N7O3
Mol. Mass.:
473.4758
SMILES:
COC1CC(C1)C(=O)Nc1cnc(cn1)-c1cnc(C#N)c(N[C@@H](C)C(=O)N(C)CC(F)F)c1
: