Target
Kappa-type opioid receptor
Ligand
BDBM397982
Substrate
Meas. Tech.
Radioligand dose-displacement Binding Assay
Ki
>20000±n/a nM
Citation
 Tafesse, L 10-substituted morphinan hydantoins US Patent  US9994571 Publication Date 6/12/2018 
Target
Name:
Kappa-type opioid receptor
Synonyms:
K-OR-1 Kappa-opioid receptor (KOR) Kappa-type opioid receptor (KOR) OPIATE Kappa OPRK1 kappa opioid receptor (KOR)
Type:
G Protein-Coupled Receptor (GPCR)
Mol. Mass.:
42648.76
Organism:
Homo sapiens (Human)
Description:
P41145
Residue:
380
  
Inhibitor
Name:
BDBM397982
Synonyms:
US9994571, Compound 9
Type:
Small organic molecule
Emp. Form.:
C23H27N3O6
Mol. Mass.:
441.477
SMILES:
COc1ccc2[C@@H](O)[C@H]3N(CC4CC4)CC[C@@]45[C@@H](Oc1c24)[C@]1(CC[C@@]35O)NC(=O)NC1=O
: