Target
Acetylcholinesterase
Ligand
BDBM31894
Substrate
BDBM8959
Meas. Tech.
AChE Inhibition Assay
pH
8±n/a
Temperature
298.15±n/a K
IC50
10.3±0.4 nM
Citation
 Camps, PFormosa, XGaldeano, CMuñoz-Torrero, DRamírez, LGómez, EIsambert, NLavilla, RBadia, AClos, MVBartolini, MMancini, FAndrisano, VArce, MPRodríguez-Franco, MIHuertas, ODafni, TLuque, FJ Pyrano[3,2-c]quinoline-6-chlorotacrine hybrids as a novel family of acetylcholinesterase- and beta-amyloid-directed anti-Alzheimer compounds. J Med Chem 52:5365-79 (2009)  
Target
Name:
Acetylcholinesterase
Synonyms:
ACES_BOVIN Acetylcholinesterase (AChE) | Acetylcholinesterase precursor
Type:
Enzyme
Mol. Mass.:
67659.62
Organism:
Bos taurus (bovine)
Description:
Residue:
613
  
Inhibitor
Name:
BDBM31894
Synonyms:
Pyrano[3,2-c]quinoline-6-chlorotacrine hybrid, 19.2HCl
Type:
Small organic molecule
Emp. Form.:
C39H40Cl2N4O2
Mol. Mass.:
667.667
SMILES:
Clc1ccc(cc1)-c1nc2ccc(cc2c2OCCCc12)C(=O)NCCCCCCCNc1c2CCCCc2nc2cc(Cl)ccc12
:
Substrate
Name:
BDBM8959
Synonyms:
(2-Mercaptoethyl)trimethylammonium iodide acetate Acetylthiocholine acetylthiocholine chloride | acetylthiocholine iodide
Type:
Small organic molecule
Emp. Form.:
C7H16NOS
Mol. Mass.:
162.272
SMILES:
CC(=O)SCC[N+](C)(C)C
: