Target
Putative hydrolase
Ligand
BDBM398048
Substrate
Meas. Tech.
Biochemical Characterization of Cif Inhibitors
IC50
>100000±n/a nM
Citation
 Madden, DRBahl, CDHammock, BDMorisseau, C Compounds and methods for inhibiting Cif virulence factor US Patent  US10322118 Publication Date 6/18/2019 
Target
Name:
Putative hydrolase
Synonyms:
CFTR inhibitory factor, Cif cif
Type:
Enzyme Catalytic Domain
Mol. Mass.:
35786.52
Organism:
Pseudomonas aeruginosa (strain UCBPP-PA14)
Description:
A0A0H2ZD27
Residue:
319
  
Inhibitor
Name:
BDBM398048
Synonyms:
US10322118, Entry 6
Type:
Small organic molecule
Emp. Form.:
C15H11I4NO4
Mol. Mass.:
776.87
SMILES:
NC(Cc1cc(I)c(Oc2cc(I)c(O)c(I)c2)c(I)c1)C(O)=O
: