Target
Putative hydrolase
Ligand
BDBM398055
Substrate
Meas. Tech.
Biochemical Characterization of Cif Inhibitors
IC50
1800±400 nM
Citation
 Madden, DRBahl, CDHammock, BDMorisseau, C Compounds and methods for inhibiting Cif virulence factor US Patent  US10322118 Publication Date 6/18/2019 
Target
Name:
Putative hydrolase
Synonyms:
CFTR inhibitory factor, Cif cif
Type:
Enzyme Catalytic Domain
Mol. Mass.:
35786.52
Organism:
Pseudomonas aeruginosa (strain UCBPP-PA14)
Description:
A0A0H2ZD27
Residue:
319
  
Inhibitor
Name:
BDBM398055
Synonyms:
US10322118, Urea-Based Scaffold Entry 3
Type:
Small organic molecule
Emp. Form.:
C16H14F2N2O2
Mol. Mass.:
304.2914
SMILES:
Cc1cc(C)cc(NC(=O)NC(=O)c2c(F)cccc2F)c1
: