Target
Putative hydrolase
Ligand
BDBM398057
Substrate
Meas. Tech.
Biochemical Characterization of Cif Inhibitors
IC50
>100000±n/a nM
Citation
 Madden, DRBahl, CDHammock, BDMorisseau, C Compounds and methods for inhibiting Cif virulence factor US Patent  US10322118 Publication Date 6/18/2019 
Target
Name:
Putative hydrolase
Synonyms:
CFTR inhibitory factor, Cif cif
Type:
Enzyme Catalytic Domain
Mol. Mass.:
35786.52
Organism:
Pseudomonas aeruginosa (strain UCBPP-PA14)
Description:
A0A0H2ZD27
Residue:
319
  
Inhibitor
Name:
BDBM398057
Synonyms:
US10322118, Urea-Based Scaffold Entry 5
Type:
Small organic molecule
Emp. Form.:
C15H11BrF2N2O2
Mol. Mass.:
369.161
SMILES:
Cc1cc(NC(=O)NC(=O)c2c(F)cccc2F)ccc1Br
: