Target
Bifunctional epoxide hydrolase 2
Ligand
BDBM398060
Substrate
Meas. Tech.
Biochemical Characterization of Cif Inhibitors
IC50
33300±n/a nM
Citation
 Madden, DRBahl, CDHammock, BDMorisseau, C Compounds and methods for inhibiting Cif virulence factor US Patent  US10322118 Publication Date 6/18/2019 
Target
Name:
Bifunctional epoxide hydrolase 2
Synonyms:
Cytosolic epoxide hydrolase 2 EPHX2 HYES_HUMAN Soluble epoxide hydrolase (sEH) | epoxide hydrolase 2, cytoplasmic
Type:
Enzyme
Mol. Mass.:
62613.07
Organism:
Homo sapiens (Human)
Description:
P34913
Residue:
555
  
Inhibitor
Name:
BDBM398060
Synonyms:
US10322118, Urea-Based Scaffold Entry 8
Type:
Small organic molecule
Emp. Form.:
C13H28O2S
Mol. Mass.:
248.425
SMILES:
CCCCCCCCCCCCS(C)(=O)=O
: