Target
Putative hydrolase
Ligand
BDBM11639
Substrate
Meas. Tech.
Biochemical Characterization of Cif Inhibitors
IC50
7400±600 nM
Citation
 Madden, DRBahl, CDHammock, BDMorisseau, C Compounds and methods for inhibiting Cif virulence factor US Patent  US10322118 Publication Date 6/18/2019 
Target
Name:
Putative hydrolase
Synonyms:
CFTR inhibitory factor, Cif cif
Type:
Enzyme Catalytic Domain
Mol. Mass.:
35786.52
Organism:
Pseudomonas aeruginosa (strain UCBPP-PA14)
Description:
A0A0H2ZD27
Residue:
319
  
Inhibitor
Name:
BDBM11639
Synonyms:
4-[5-(4-methylphenyl)-3-(trifluoromethyl)-1H-pyrazol-1-yl]benzene-1-sulfonamide CLX Celecoxib US11478464, Compound Celecoxib US8741944, Comparative Compound cid_2662
Type:
Small organic molecule
Emp. Form.:
C17H14F3N3O2S
Mol. Mass.:
381.372
SMILES:
Cc1ccc(cc1)-c1cc(nn1-c1ccc(cc1)S(N)(=O)=O)C(F)(F)F
: