Target
Bifunctional epoxide hydrolase 2
Ligand
BDBM50327827
Substrate
Meas. Tech.
Biochemical Characterization of Cif Inhibitors
IC50
38.0±n/a nM
Citation
 Madden, DRBahl, CDHammock, BDMorisseau, C Compounds and methods for inhibiting Cif virulence factor US Patent  US10322118 Publication Date 6/18/2019 
Target
Name:
Bifunctional epoxide hydrolase 2
Synonyms:
Cytosolic epoxide hydrolase 2 EPHX2 HYES_HUMAN Soluble epoxide hydrolase (sEH) | epoxide hydrolase 2, cytoplasmic
Type:
Enzyme
Mol. Mass.:
62613.07
Organism:
Homo sapiens (Human)
Description:
P34913
Residue:
555
  
Inhibitor
Name:
BDBM50327827
Synonyms:
1-(4-Nitrophenyl)-3-(1-propionylpiperidin-4-yl)urea US10322118, Urea-Based Scaffold Entry 10 | US9296693, 20
Type:
Small organic molecule
Emp. Form.:
C15H20N4O4
Mol. Mass.:
320.3437
SMILES:
CCC(=O)N1CCC(CC1)NC(=O)Nc1ccc(cc1)[N+]([O-])=O
: