Target
Dimer of Gag-Pol polyprotein [501-599]
Ligand
BDBM32391
Substrate
HIV-1 PR Substrate Peptide
Meas. Tech.
Enzyme Inhibition Assay
pH
5.5±n/a
Temperature
296.15±n/a K
Ki
900±n/a nM
Km
14600±n/a nM
Citation
 Blum, ABöttcher, JSammet, BLuksch, THeine, AKlebe, GDiederich, WE Achiral oligoamines as versatile tool for the development of aspartic protease inhibitors. Bioorg Med Chem 16:8574-86 (2008)  
Target
Name:
Dimer of Gag-Pol polyprotein [501-599]
Synonyms:
HIV-1 Protease | HIV-1 Protease, recombinant, isolate HXB2
Type:
Protein Complex
Mol. Mass.:
Description:
Components:
This complex has 2 components.
Component 1
Name:
Gag-Pol polyprotein [501-599]
Synonyms:
BRU isolated HIV-1 Protease B Subtype Chain B LAI(Wild type) Protease Retropepsin | gag-pol
Type:
Enzyme Subunit
Mol. Mass.:
10795.19
Organism:
Human immunodeficiency virus type 1
Description:
P03367[501-599]
Residue:
99
  
Component 2
Name:
Gag-Pol polyprotein [501-599]
Synonyms:
BRU isolated HIV-1 Protease B Subtype Chain B LAI(Wild type) Protease Retropepsin | gag-pol
Type:
Enzyme Subunit
Mol. Mass.:
10795.19
Organism:
Human immunodeficiency virus type 1
Description:
P03367[501-599]
Residue:
99
  
Inhibitor
Name:
BDBM32391
Synonyms:
iso-butyl-substituted sulfonamide, 9b
Type:
Small organic molecule
Emp. Form.:
C24H39N5O4S2
Mol. Mass.:
525.728
SMILES:
CC(C)CN(CCNCCN(CC(C)C)S(=O)(=O)c1ccc(N)cc1)S(=O)(=O)c1ccc(N)cc1
:
Substrate
Name:
HIV-1 PR Substrate Peptide
Synonyms:
Type:
fluorogenic substrate
Mol. Mass.:
2590.28
Organism:
Description:
Residue:
23