Target
Plasmepsin II
Ligand
BDBM32391
Substrate
Plasmepsin Substrate Peptide
Meas. Tech.
Enzyme Inhibition Assay
pH
4.5±n/a
Temperature
296.15±n/a K
Ki
6800±n/a nM
Km
63000±n/a nM
Citation
 Blum, ABöttcher, JSammet, BLuksch, THeine, AKlebe, GDiederich, WE Achiral oligoamines as versatile tool for the development of aspartic protease inhibitors. Bioorg Med Chem 16:8574-86 (2008)  
Target
Name:
Plasmepsin II
Synonyms:
Aspartic hemoglobinase II PLM2_PLAFX Plasmepsin 2 Plasmepsin-II
Type:
Enzyme
Mol. Mass.:
51482.09
Organism:
Plasmodium falciparum
Description:
P46925
Residue:
453
  
Inhibitor
Name:
BDBM32391
Synonyms:
iso-butyl-substituted sulfonamide, 9b
Type:
Small organic molecule
Emp. Form.:
C24H39N5O4S2
Mol. Mass.:
525.728
SMILES:
CC(C)CN(CCNCCN(CC(C)C)S(=O)(=O)c1ccc(N)cc1)S(=O)(=O)c1ccc(N)cc1
:
Substrate
Name:
Plasmepsin Substrate Peptide
Synonyms:
Type:
fluorogenic substrate
Mol. Mass.:
2590.28
Organism:
Description:
Residue:
23