Target
Plasmepsin IV
Ligand
BDBM32391
Substrate
Plasmepsin Substrate Peptide
Meas. Tech.
Enzyme Inhibition Assay
Temperature
298.15±n/a K
Ki
56000±n/a nM
Comments
extracted
Citation
 Blum, ABöttcher, JSammet, BLuksch, THeine, AKlebe, GDiederich, WE Achiral oligoamines as versatile tool for the development of aspartic protease inhibitors. Bioorg Med Chem 16:8574-86 (2008)  
Target
Name:
Plasmepsin IV
Synonyms:
PLM4_PLAF7 | PMIV
Type:
Enzyme
Mol. Mass.:
51038.16
Organism:
Plasmodium falciparum
Description:
Q8IM16
Residue:
449
  
Inhibitor
Name:
BDBM32391
Synonyms:
iso-butyl-substituted sulfonamide, 9b
Type:
Small organic molecule
Emp. Form.:
C24H39N5O4S2
Mol. Mass.:
525.728
SMILES:
CC(C)CN(CCNCCN(CC(C)C)S(=O)(=O)c1ccc(N)cc1)S(=O)(=O)c1ccc(N)cc1
:
Substrate
Name:
Plasmepsin Substrate Peptide
Synonyms:
Type:
fluorogenic substrate
Mol. Mass.:
2590.28
Organism:
Description:
Residue:
23