Target
Renin
Ligand
BDBM32391
Substrate
Renin Substrate Peptide
Meas. Tech.
Enzyme Inhibition Assay
Temperature
298.15±n/a K
IC50
>250000±n/a nM
Comments
extracted
Citation
 Blum, ABöttcher, JSammet, BLuksch, THeine, AKlebe, GDiederich, WE Achiral oligoamines as versatile tool for the development of aspartic protease inhibitors. Bioorg Med Chem 16:8574-86 (2008)  
Target
Name:
Renin
Synonyms:
Angiotensinogenase RENI_HUMAN
Type:
Enzyme
Mol. Mass.:
45058.99
Organism:
Homo sapiens (Human)
Description:
Residue:
406
  
Inhibitor
Name:
BDBM32391
Synonyms:
iso-butyl-substituted sulfonamide, 9b
Type:
Small organic molecule
Emp. Form.:
C24H39N5O4S2
Mol. Mass.:
525.728
SMILES:
CC(C)CN(CCNCCN(CC(C)C)S(=O)(=O)c1ccc(N)cc1)S(=O)(=O)c1ccc(N)cc1
:
Substrate
Name:
Renin Substrate Peptide
Synonyms:
Type:
fluorogenic substrate
Mol. Mass.:
5461.57
Organism:
Description:
Residue:
49