Target
Beta-secretase 1 [22-457]
Ligand
BDBM32391
Substrate
BACE Substrate Peptide
Meas. Tech.
Enzyme Inhibition Assay
Temperature
298.15±n/a K
IC50
>250000±n/a nM
Comments
extracted
Citation
 Blum, ABöttcher, JSammet, BLuksch, THeine, AKlebe, GDiederich, WE Achiral oligoamines as versatile tool for the development of aspartic protease inhibitors. Bioorg Med Chem 16:8574-86 (2008)  
Target
Name:
Beta-secretase 1 [22-457]
Synonyms:
Aspartyl protease 2 BACE1 Beta-site amyloid precursor protein cleaving enzyme 1 Membrane-associated aspartic protease 2 | beta-Secretase (BACE-1)
Type:
Extracellular Domain
Mol. Mass.:
48425.17
Organism:
Homo sapiens (Human)
Description:
Recombinant beta-secretase was purchased from Sigma.
Residue:
436
  
Inhibitor
Name:
BDBM32391
Synonyms:
iso-butyl-substituted sulfonamide, 9b
Type:
Small organic molecule
Emp. Form.:
C24H39N5O4S2
Mol. Mass.:
525.728
SMILES:
CC(C)CN(CCNCCN(CC(C)C)S(=O)(=O)c1ccc(N)cc1)S(=O)(=O)c1ccc(N)cc1
:
Substrate
Name:
BACE Substrate Peptide
Synonyms:
Type:
fluorogenic substrate
Mol. Mass.:
5746.92
Organism:
Description:
Residue:
54