Target
Glutamate receptor ionotropic, NMDA 2B
Ligand
BDBM396838
Substrate
Meas. Tech.
Inhibition of Specific Binding to the Rat NR1/NR2B Receptor
IC50
7.68±n/a nM
Citation
 Schindler, RLankau, HHöfgen, NEgerland, ULangen, BDost, RWard, S Triazoles as NR2B receptor inhibitors US Patent  US10323021 Publication Date 6/18/2019 
Target
Name:
Glutamate receptor ionotropic, NMDA 2B
Synonyms:
GluN2B Grin2b NMDA receptor subunit N2B (GluN2B) NMDE2_RAT | NR2B
Type:
Protein
Mol. Mass.:
166077.66
Organism:
Rattus norvegicus (Rat)
Description:
Q00960
Residue:
1482
  
Inhibitor
Name:
BDBM396838
Synonyms:
US9981950, Example 45
Type:
Small organic molecule
Emp. Form.:
C16H17ClFN5
Mol. Mass.:
333.791
SMILES:
CCCCc1nccn1Cc1cn(nn1)-c1ccc(F)c(Cl)c1
: