Target
Prothrombin
Ligand
BDBM32652
Substrate
BDBM23868
Meas. Tech.
Enzyme Inhibition Assay
pH
7.4±n/a
Temperature
298.15±n/a K
Ki
6800±1500 nM
Citation
 Baum, BMuley, LHeine, ASmolinski, MHangauer, DKlebe, G Think twice: understanding the high potency of bis(phenyl)methane inhibitors of thrombin. J Mol Biol 391:552-64 (2009)  
Target
Name:
Prothrombin
Synonyms:
Activation peptide fragment 1 Coagulation factor II Prothrombin precursor Thrombin heavy chain | Thrombin light chain
Type:
Protein
Mol. Mass.:
70029.57
Organism:
Homo sapiens (Human)
Description:
P00734
Residue:
622
  
Inhibitor
Name:
BDBM32652
Synonyms:
m-chlorobenzylamide, 1
Type:
Small organic molecule
Emp. Form.:
C16H22ClN3O2
Mol. Mass.:
323.818
SMILES:
CC[C@@H](N)C(=O)N1CCCC1C(=O)NCc1cccc(Cl)c1
:
Substrate
Name:
BDBM23868
Synonyms:
(2S)-5-carbamimidamido-2-{2-[(2R)-3-(4-hydroxycyclohexyl)-2-methanesulfonamidopropanamido]acetamido}-N-(4-nitrophenyl)pentanamide Pefachrome tPA
Type:
chromogenic substrate
Emp. Form.:
C24H38N8O8S
Mol. Mass.:
598.672
SMILES:
CS(=O)(=O)NC(CC1CCC(O)CC1)C(=O)NCC(=O)NC(CCC\[NH+]=C(/N)[NH-])C(=O)Nc1ccc(cc1)[N+]([O-])=O
: