Target
Coagulation factor XI
Ligand
BDBM32761
Substrate
Boc-Glu-Ala-Arg-AMC
Meas. Tech.
Factor XIa 1536 HTS Dose Response Confirmation
pH
7.4±n/a
Temperature
296.15±n/a K
IC50
2183.7±158.8 nM
Citation
 PubChem, PC Factor XIa 1536 HTS Dose Response Confirmation PubChem Bioassay (2008)[AID] 
Target
Name:
Coagulation factor XI
Synonyms:
Coagulation factor XIa Coagulation factor XIa light chain FA11_HUMAN Factor XIa PTA | Plasma thromboplastin antecedent
Type:
Enzyme
Mol. Mass.:
70130.58
Organism:
Homo sapiens (Human)
Description:
P03951
Residue:
625
  
Inhibitor
Name:
BDBM32761
Synonyms:
2-furancarboxylic acid [5-amino-1-(4-methoxyphenyl)sulfonyl-3-pyrazolyl] ester MLS000033887 US11584714, Compound 40# [5-azanyl-1-(4-methoxyphenyl)sulfonyl-pyrazol-3-yl] furan-2-carboxylate furan-2-carboxylic acid [5-amino-1-(4-methoxyphenyl)sulfonyl-pyrazol-3-yl] ester
Type:
Small organic molecule
Emp. Form.:
C15H13N3O6S
Mol. Mass.:
363.345
SMILES:
COc1ccc(cc1)S(=O)(=O)n1nc(OC(=O)c2ccco2)cc1N
:
Substrate
Name:
Boc-Glu-Ala-Arg-AMC
Synonyms:
Type:
fluorescent substrate peptide
Mol. Mass.:
358.43
Organism:
Description:
Residue:
3
NA