Target
Bcl-2-related protein A1
Ligand
BDBM33074
Substrate
FITC-conjugated-Bim BH3 Peptide
Meas. Tech.
Multiplexed dose response screen for small molecule regulators of Bcl-2 family protein interactions, specifically Bim-Bfl-1.
pH
7.4±n/a
Temperature
277.15±n/a K
EC50
6040±n/a nM
Citation
 PubChem, PC Multiplexed dose response screen for small molecule regulators of Bcl-2 family protein interactions, specifically Bim-Bfl-1. PubChem Bioassay (2008)[AID] 
Target
Name:
Bcl-2-related protein A1
Synonyms:
B2LA1_HUMAN BCL2L5 Bcl-2-like protein 5 HBPA1 Protein BFL-1 | Protein GRS
Type:
Apoptosis regulator protein
Mol. Mass.:
20130.01
Organism:
Homo sapiens (Human)
Description:
Residue:
175
  
Inhibitor
Name:
BDBM33074
Synonyms:
3-Chloro-1-(2-chloro-phenyl)-4-(1,5-dimethyl-3-oxo-2-phenyl-2,3-dihydro-1H-pyrazol-4-ylamino)-pyrrole -2,5-dione 3-chloro-1-(2-chlorophenyl)-4-[(1,5-dimethyl-3-oxo-2-phenyl-4-pyrazolyl)amino]pyrrole-2,5-dione 3-chloro-1-(2-chlorophenyl)-4-[(3-keto-1,5-dimethyl-2-phenyl-3-pyrazolin-4-yl)amino]-3-pyrroline-2,5-quinone SMR000146209 | cid_1177166
Type:
Small organic molecule
Emp. Form.:
C21H16Cl2N4O3
Mol. Mass.:
443.283
SMILES:
Cc1c(N=C2C(Cl)C(=O)N(C2=O)c2ccccc2Cl)c(=O)n(-c2ccccc2)n1C
:
Substrate
Name:
FITC-conjugated-Bim BH3 Peptide
Synonyms:
FITC-Ahx-DMRPEIWIAQELRRIGDEFNAYYAR-OH
Type:
FITC-labeled Peptide
Mol. Mass.:
3112.46
Organism:
Description:
Residue:
25