Target
Peroxisome proliferator-activated receptor alpha
Ligand
BDBM33287
Substrate
BDBM33283
Meas. Tech.
Scintillation Proximity Assay (IC50) and PPAR alpha Transactivation Assay (EC50)
pH
7.2±n/a
Temperature
288.15±n/a K
EC50
8500±n/a nM
Comments
Efficacy=48% (The maximum efficacy of GW9578 was defined as 100%).
Citation
 Casimiro-Garcia, ABigge, CFDavis, JAPadalino, TPulaski, JOhren, JFMcConnell, PKane, CDRoyer, LJStevens, KAAuerbach, BCollard, WMcGregor, CSong, K Synthesis and evaluation of novel alpha-heteroaryl-phenylpropanoic acid derivatives as PPARalpha/gamma dual agonists. Bioorg Med Chem 17:7113-25 (2009)  
Target
Name:
Peroxisome proliferator-activated receptor alpha
Synonyms:
NR1C1 PPAR PPAR-alpha PPARA_HUMAN Peroxisome proliferator-activated receptor | Peroxisome proliferator-activated receptor alpha (PPAR alpha)
Type:
Enzyme
Mol. Mass.:
52222.08
Organism:
Homo sapiens (Human)
Description:
Q07869
Residue:
468
  
Inhibitor
Name:
BDBM33287
Synonyms:
phenylpropanoic acid derivative, 17c | racemic
Type:
Small organic molecule
Emp. Form.:
C26H26N2O4
Mol. Mass.:
430.4956
SMILES:
Cc1cc(on1)C(Cc1ccc(CCCc2nc(oc2C)-c2ccccc2)cc1)C(O)=O
:
Substrate
Name:
BDBM33283
Synonyms:
(3-{4-[(3-phenyl-7-propyl-1,2-benzisoxazol-6-yl)oxy]butoxy}phenyl)acetic acid [3H]nTZD3
Type:
radiolabeled ligand
Emp. Form.:
C28H29NO5
Mol. Mass.:
459.5336
SMILES:
CCCc1c(OCCCCOc2cccc(CC(O)=O)c2)ccc2c(noc12)-c1ccccc1
: