Target
Peroxisome proliferator-activated receptor alpha
Ligand
BDBM33296
Substrate
BDBM33283
Meas. Tech.
Scintillation Proximity Assay (IC50) and PPAR alpha Transactivation Assay (EC50)
pH
7.2±n/a
Temperature
288.15±n/a K
IC50
>3300±n/a nM
EC50
5000±n/a nM
Comments
Efficacy=28% (The maximum efficacy of GW9578 was defined as 100%).
Citation
 Casimiro-Garcia, ABigge, CFDavis, JAPadalino, TPulaski, JOhren, JFMcConnell, PKane, CDRoyer, LJStevens, KAAuerbach, BCollard, WMcGregor, CSong, K Synthesis and evaluation of novel alpha-heteroaryl-phenylpropanoic acid derivatives as PPARalpha/gamma dual agonists. Bioorg Med Chem 17:7113-25 (2009)  
Target
Name:
Peroxisome proliferator-activated receptor alpha
Synonyms:
NR1C1 PPAR PPAR-alpha PPARA_HUMAN Peroxisome proliferator-activated receptor | Peroxisome proliferator-activated receptor alpha (PPAR alpha)
Type:
Enzyme
Mol. Mass.:
52222.08
Organism:
Homo sapiens (Human)
Description:
Q07869
Residue:
468
  
Inhibitor
Name:
BDBM33296
Synonyms:
BMC164883 Compound 58 racemic
Type:
Small organic molecule
Emp. Form.:
C28H27NO3
Mol. Mass.:
425.5189
SMILES:
Cc1oc(nc1CCCc1ccc(CC(C(O)=O)c2ccccc2)cc1)-c1ccccc1
:
Substrate
Name:
BDBM33283
Synonyms:
(3-{4-[(3-phenyl-7-propyl-1,2-benzisoxazol-6-yl)oxy]butoxy}phenyl)acetic acid [3H]nTZD3
Type:
radiolabeled ligand
Emp. Form.:
C28H29NO5
Mol. Mass.:
459.5336
SMILES:
CCCc1c(OCCCCOc2cccc(CC(O)=O)c2)ccc2c(noc12)-c1ccccc1
: