Target
Peroxisome proliferator-activated receptor gamma
Ligand
BDBM33286
Substrate
BDBM33297
Meas. Tech.
Scintillation Proximity Assay (IC50) and PPAR gamma Transactivation Assay (EC50)
pH
7.4±n/a
Temperature
296.15±n/a K
IC50
14000±n/a nM
EC50
1900±n/a nM
Comments
Efficacy=42% (The maximum efficacy of darglitazone was defined as 100%).
Citation
 Casimiro-Garcia, ABigge, CFDavis, JAPadalino, TPulaski, JOhren, JFMcConnell, PKane, CDRoyer, LJStevens, KAAuerbach, BCollard, WMcGregor, CSong, K Synthesis and evaluation of novel alpha-heteroaryl-phenylpropanoic acid derivatives as PPARalpha/gamma dual agonists. Bioorg Med Chem 17:7113-25 (2009)  
Target
Name:
Peroxisome proliferator-activated receptor gamma
Synonyms:
NR1C3 PPAR-gamma PPARG_HUMAN Peroxisome proliferator-activated receptor gamma (PPAR gamma) Peroxisome proliferator-activated receptor gamma (PPARĪ³) peroxisome proliferator-activated receptor gamma isoform 2
Type:
Nuclear Receptor
Mol. Mass.:
57613.46
Organism:
Homo sapiens (Human)
Description:
P37231
Residue:
505
  
Inhibitor
Name:
BDBM33286
Synonyms:
phenylpropanoic acid derivative, 17b | racemic
Type:
Small organic molecule
Emp. Form.:
C26H26N2O4
Mol. Mass.:
430.4956
SMILES:
Cc1cc(no1)C(Cc1ccc(CCCc2nc(oc2C)-c2ccccc2)cc1)C(O)=O
:
Substrate
Name:
BDBM33297
Synonyms:
[3H]Darglitazone
Type:
radiolabeled ligand
Emp. Form.:
C23H20N2O4S
Mol. Mass.:
420.481
SMILES:
Cc1oc(nc1CCC(=O)c1ccc(CC2SC(=O)NC2=O)cc1)-c1ccccc1
: