Target
Peroxisome proliferator-activated receptor gamma
Ligand
BDBM33289
Substrate
BDBM33297
Meas. Tech.
Scintillation Proximity Assay (IC50) and PPAR gamma Transactivation Assay (EC50)
pH
7.4±n/a
Temperature
296.15±n/a K
IC50
145±n/a nM
EC50
65±n/a nM
Comments
Efficacy=91% (The maximum efficacy of darglitazone was defined as 100%).
Citation
 Casimiro-Garcia, ABigge, CFDavis, JAPadalino, TPulaski, JOhren, JFMcConnell, PKane, CDRoyer, LJStevens, KAAuerbach, BCollard, WMcGregor, CSong, K Synthesis and evaluation of novel alpha-heteroaryl-phenylpropanoic acid derivatives as PPARalpha/gamma dual agonists. Bioorg Med Chem 17:7113-25 (2009)  
Target
Name:
Peroxisome proliferator-activated receptor gamma
Synonyms:
NR1C3 PPAR-gamma PPARG_HUMAN Peroxisome proliferator-activated receptor gamma (PPAR gamma) Peroxisome proliferator-activated receptor gamma (PPARĪ³) peroxisome proliferator-activated receptor gamma isoform 2
Type:
Nuclear Receptor
Mol. Mass.:
57613.46
Organism:
Homo sapiens (Human)
Description:
P37231
Residue:
505
  
Inhibitor
Name:
BDBM33289
Synonyms:
phenylpropanoic acid derivative, 17e
Type:
Small organic molecule
Emp. Form.:
C25H25N3O3
Mol. Mass.:
415.4843
SMILES:
Cc1oc(nc1CCCc1ccc(C[C@@H](C(O)=O)n2cccn2)cc1)-c1ccccc1
:
Substrate
Name:
BDBM33297
Synonyms:
[3H]Darglitazone
Type:
radiolabeled ligand
Emp. Form.:
C23H20N2O4S
Mol. Mass.:
420.481
SMILES:
Cc1oc(nc1CCC(=O)c1ccc(CC2SC(=O)NC2=O)cc1)-c1ccccc1
: