Target
Sodium/bile acid cotransporter
Ligand
BDBM400089
Substrate
Meas. Tech.
HBV DNA Quantification Assay
EC50
6.50±n/a nM
Citation
 Du, JKaplan, JAKirschberg, TAKobayashi, TLazerwith, SELee, RAMedley, JWMitchell, MLMorganelli, PAPyun, HShevick, SLSquires, NHWatkins, WJ Substituted pyrrolizine compounds and uses thereof US Patent  US10328053 Publication Date 6/25/2019 
Target
Name:
Sodium/bile acid cotransporter
Synonyms:
Bile acid transporter NTCP_HUMAN | SLC10A1
Type:
PROTEIN
Mol. Mass.:
38131.81
Organism:
Homo sapiens (Human)
Description:
ChEMBL_838517
Residue:
349
  
Inhibitor
Name:
BDBM400089
Synonyms:
6-methyl-7-(2-oxo-2-((1-phenylcyclopropyl)amino)acetyl)-N-(3,4,5-trifluorophenyl)-2,3-dihydro-1H-pyrrolizine-5-carboxamide US10874640, Compound 67 | US20230270719, Compound 67
Type:
Small organic molecule
Emp. Form.:
C26H22F3N3O3
Mol. Mass.:
481.4664
SMILES:
Cc1c(C(=O)C(=O)NC2(CC2)c2ccccc2)c2CCCn2c1C(=O)Nc1cc(F)c(F)c(F)c1
: