Target
Lysine-specific histone demethylase 1A
Ligand
BDBM283222
Substrate
Meas. Tech.
In Vitro Enzyme Inhibition Assay-LSD-1
IC50
<100±n/a nM
Citation
 Xu, JCho, RNguyen, A Treatment of relapsed and/or refractory solid tumors and non-hodgkin's lymphomas US Patent  US10328077 Publication Date 6/25/2019 
Target
Name:
Lysine-specific histone demethylase 1A
Synonyms:
AOF2 Flavin-containing amine oxidase domain-containing protein 2 KDM1A KIAA0601 Lysine-specific demethylase 1 (LSD1) Lysine-specific histone demethylase 1 (LSD1)
Type:
Enzyme
Mol. Mass.:
92901.01
Organism:
Homo sapiens (Human)
Description:
O60341
Residue:
852
  
Inhibitor
Name:
BDBM283222
Synonyms:
2-fluoro-4-[5-(3-fluoro-4-methoxy- phenyl)-1-methyl-2-(4-methyl- amino-piperidin-1-yl)-6-oxo-1,6- dihydro-pyrimidin-4-yl]- benzonitrile US10207999, Example 12 US10548896, Example 12 US10960005, Example 12 US9573930, Example 12 US9776974, Example 12
Type:
Small organic molecule
Emp. Form.:
C25H25F2N5O2
Mol. Mass.:
465.4951
SMILES:
CNC1CCN(CC1)c1nc(-c2ccc(C#N)c(F)c2)c(-c2ccc(OC)c(F)c2)c(=O)n1C
: