Target
Lysine-specific histone demethylase 1A
Ligand
BDBM283226
Substrate
Meas. Tech.
In Vitro Enzyme Inhibition Assay-LSD-1
IC50
<100±n/a nM
Citation
 Xu, JCho, RNguyen, A Treatment of relapsed and/or refractory solid tumors and non-hodgkin's lymphomas US Patent  US10328077 Publication Date 6/25/2019 
Target
Name:
Lysine-specific histone demethylase 1A
Synonyms:
AOF2 Flavin-containing amine oxidase domain-containing protein 2 KDM1A KIAA0601 Lysine-specific demethylase 1 (LSD1) Lysine-specific histone demethylase 1 (LSD1)
Type:
Enzyme
Mol. Mass.:
92901.01
Organism:
Homo sapiens (Human)
Description:
O60341
Residue:
852
  
Inhibitor
Name:
BDBM283226
Synonyms:
2-[2-(4-amino-piperidin-1-yl)-4- (4-cyano-3-fluoro-phenyl)-5-(4- methoxy-phenyl)-6-oxo-6H- pyrimidin-1-yl]-acetamide US10207999, Example 16 US10548896, Example 16 US10960005, Example 16 US9573930, Example 16 US9776974, Example 16
Type:
Small organic molecule
Emp. Form.:
C25H25FN6O3
Mol. Mass.:
476.5028
SMILES:
COc1ccc(cc1)-c1c(nc(N2CCC(N)CC2)n(CC(N)=O)c1=O)-c1ccc(C#N)c(F)c1
: