Target
Tyrosine-protein kinase JAK2 [828-1132]
Ligand
BDBM400374
Substrate
Meas. Tech.
In Vitro JAK Kinase Assay
IC50
<5±n/a nM
Citation
 Huang, TXue, C Piperidin-4-yl azetidine derivatives as JAK1 inhibitors US Patent  US9999619 Publication Date 6/19/2018 
Target
Name:
Tyrosine-protein kinase JAK2 [828-1132]
Synonyms:
JAK2 JAK2_HUMAN | Tyrosine-protein kinase JAK2
Type:
Mol. Mass.:
35579.28
Organism:
Homo sapiens (Human)
Description:
O60674[828-1132]
Residue:
305
  
Inhibitor
Name:
BDBM400374
Synonyms:
US10695337, Example 128 US9999619, Example 129
Type:
Small organic molecule
Emp. Form.:
C33H27F2N9O
Mol. Mass.:
603.624
SMILES:
Fc1cc(cc(c1)-c1ccc(cc1F)C(=O)N1CCC(CC1)N1CC(CC#N)(C1)n1cc(cn1)-c1ncnc2[nH]ccc12)C#N
: