Target
5-hydroxytryptamine receptor 6
Ligand
BDBM34141
Substrate
BDBM21342
Meas. Tech.
5-HT6 Binding Assay
pH
7.4±n/a
Temperature
310.15±n/a K
Ki
2±n/a nM
Comments
antagonist.
Citation
 Alcalde, EMesquida, NLópez-Pérez, SFrigola, JMercè, RHolenz, JPujol, MHernández, E Indene-based frameworks targeting the 5-HT6 serotonin receptor: ring constraint in indenylsulfonamides using cyclic amines and structurally abbreviated counterparts. Bioorg Med Chem 17:7387-97 (2009)  
Target
Name:
5-hydroxytryptamine receptor 6
Synonyms:
5-HT-6 5-hydroxytryptamine receptor 6 (5-HT-6) 5-hydroxytryptamine receptor 6 (5HT6) HTR6 Serotonin 6 (5-HT6) receptor | Serotonin Receptor 6
Type:
G Protein-Coupled Receptor (GPCR)
Mol. Mass.:
46968.43
Organism:
Homo sapiens (Human)
Description:
P50406
Residue:
440
  
Inhibitor
Name:
BDBM34141
Synonyms:
CHEMBL76237 | MS-245
Type:
Small organic molecule
Emp. Form.:
C19H22N2O3S
Mol. Mass.:
358.455
SMILES:
COc1ccc2n(cc(CCN(C)C)c2c1)S(=O)(=O)c1ccccc1
:
Substrate
Name:
BDBM21342
Synonyms:
(4R,7R)-N,N-diethyl-6-methyl-6,11-diazatetracyclo[7.6.1.0^{2,7}.0^{12,16}]hexadeca-1(16),2,9,12,14-pentaene-4-carboxamide LSD LSD,(+) Lysergic Acid Diethylamide [3H]-LSD | d-Isolysergic acid amide
Type:
radiolabeled ligand
Emp. Form.:
C20H25N3O
Mol. Mass.:
323.432
SMILES:
[H][C@@]12Cc3c[nH]c4cccc(C1=C[C@H](CN2C)C(=O)N(CC)CC)c34
: