Target
Gag-Pol polyprotein
Ligand
BDBM34524
Substrate
RNA/DNA hybrid
Meas. Tech.
HIV-1 RT-RNase H MLSCN MH077605 Probe Assessment: Dose response Assay
pH
8±0
Temperature
296.15±0 K
IC50
4278.999805±n/a nM
Citation
 PubChem, PC HIV-1 RT-RNase H MLSCN MH077605 Probe Assessment: Dose response Assay PubChem Bioassay (2007)[AID] 
Target
Name:
Gag-Pol polyprotein
Synonyms:
HIV-1 reverse transcriptase (HIV-1 RT) POL_HV1H2 Protease Reverse transcriptase (RT) gag-pol p66 RT
Type:
Protein
Mol. Mass.:
162074.74
Organism:
Human immunodeficiency virus type 1 group M subtype B (isolate HXB2)
Description:
P04585
Residue:
1435
  
Inhibitor
Name:
BDBM34524
Synonyms:
2-[2-keto-2-[3-methyl-4-(m-tolyl)piperazino]ethyl]-4,6-dimethyl-isothiazolo[5,4-b]pyridin-3-one 4,6-dimethyl-2-[2-[3-methyl-4-(3-methylphenyl)piperazin-1-yl]-2-oxidanylidene-ethyl]-[1,2]thiazolo[5,4-b]pyridin-3-one MLS000118900 cid_5309798
Type:
Small organic molecule
Emp. Form.:
C22H26N4O2S
Mol. Mass.:
410.532
SMILES:
CC1CN(CCN1c1cccc(C)c1)C(=O)Cn1sc2nc(C)cc(C)c2c1=O
:
Substrate
Name:
RNA/DNA hybrid
Synonyms:
Type:
fluorescein-labeled RNA annealed to DNA
Mol. Mass.:
358.43
Organism:
Description:
It is a 18-nucleotide 3-fluorescein-labeled RNA annealed to a complementary 18-nucleotide 5-Dabcyl-modified DNA.
Residue:
3
NA